Target
Adenosine receptor A1
Ligand
BDBM50300876
Substrate
Meas. Tech.
ChEMBL_599658 (CHEMBL1042902)
Ki
400±n/a nM
Citation
 El-Tayeb, AIqbal, JBehrenswerth, ARomio, MSchneider, MZimmermann, HSchrader, JMüller, CE Nucleoside-5'-monophosphates as prodrugs of adenosine A2A receptor agonists activated by ecto-5'-nucleotidase. J Med Chem 52:7669-77 (2009)  
Target
Name:
Adenosine receptor A1
Synonyms:
AA1R_RAT ADENOSINE A1 high Adenosine A1 receptor (A1) Adenosine receptors A1 | Adora1
Type:
Protein
Mol. Mass.:
36704.13
Organism:
Rattus norvegicus (rat)
Description:
Residue:
326
  
Inhibitor
Name:
BDBM50300876
Synonyms:
(2R,3R,4S,5R)-2-(6-amino-2-(2-cyclohexylethylthio)-9H-purin-9-yl)-5-(hydroxymethyl)tetrahydrofuran-3,4-diol | CHEMBL568023
Type:
Small organic molecule
Emp. Form.:
C18H27N5O4S
Mol. Mass.:
409.503
SMILES:
Nc1nc(SCCC2CCCCC2)nc2n(cnc12)[C@@H]1O[C@H](CO)[C@@H](O)[C@H]1O
: