Target
Transporter
Ligand
BDBM50264063
Substrate
Meas. Tech.
ChEMBL_598777 (CHEMBL1042017)
Ki
58.2±n/a nM
Citation
 Jobson, NKCrawford, ARDewar, DPimlott, SLSutherland, A Design and synthesis of (2R,3S)-iodoreboxetine analogues for SPECT imaging of the noradrenaline transporter. Bioorg Med Chem Lett 19:4996-8 (2009)  
Target
Name:
Transporter
Synonyms:
NE transporter Norepinephrine transporter(NET)
Type:
Multi-pass membrane protein
Mol. Mass.:
69236.90
Organism:
Rattus norvegicus (rat)
Description:
Q63380
Residue:
617
  
Inhibitor
Name:
BDBM50264063
Synonyms:
(2R,3S)-iodoreboxetine CHEMBL490995
Type:
Small organic molecule
Emp. Form.:
C19H22INO3
Mol. Mass.:
439.2874
SMILES:
CCOc1ccccc1O[C@H]([C@H]1CNCCO1)c1ccc(I)cc1
: