Target
Metabotropic glutamate receptor 1
Ligand
BDBM50301522
Substrate
Meas. Tech.
ChEMBL_600490 (CHEMBL1046437)
IC50
62±n/a nM
Citation
 Satoh, ANagatomi, YHirata, YIto, SSuzuki, GKimura, TMaehara, SHikichi, HSatow, AHata, MOhta, HKawamoto, H Discovery and in vitro and in vivo profiles of 4-fluoro-N-[4-[6-(isopropylamino)pyrimidin-4-yl]-1,3-thiazol-2-yl]-N-methylbenzamide as novel class of an orally active metabotropic glutamate receptor 1 (mGluR1) antagonist. Bioorg Med Chem Lett 19:5464-8 (2009)  
Target
Name:
Metabotropic glutamate receptor 1
Synonyms:
GPRC1A GRM1_HUMAN Metabotropic Glutamate 1a | metabotropic glutamate 1
Type:
Enzyme
Mol. Mass.:
132358.19
Organism:
Homo sapiens (Human)
Description:
Q13255
Residue:
1194
  
Inhibitor
Name:
BDBM50301522
Synonyms:
4-chloro-N-methyl-N-(4-(pyridin-4-yl)thiazol-2-yl)benzamide | CHEMBL577035
Type:
Small organic molecule
Emp. Form.:
C16H12ClN3OS
Mol. Mass.:
329.804
SMILES:
CN(C(=O)c1ccc(Cl)cc1)c1nc(cs1)-c1ccncc1
: