Target
Metabotropic glutamate receptor 1
Ligand
BDBM50301520
Substrate
Meas. Tech.
ChEMBL_600490 (CHEMBL1046437)
IC50
5.1±n/a nM
Citation
 Satoh, ANagatomi, YHirata, YIto, SSuzuki, GKimura, TMaehara, SHikichi, HSatow, AHata, MOhta, HKawamoto, H Discovery and in vitro and in vivo profiles of 4-fluoro-N-[4-[6-(isopropylamino)pyrimidin-4-yl]-1,3-thiazol-2-yl]-N-methylbenzamide as novel class of an orally active metabotropic glutamate receptor 1 (mGluR1) antagonist. Bioorg Med Chem Lett 19:5464-8 (2009)  
Target
Name:
Metabotropic glutamate receptor 1
Synonyms:
GPRC1A GRM1_HUMAN Metabotropic Glutamate 1a | metabotropic glutamate 1
Type:
Enzyme
Mol. Mass.:
132358.19
Organism:
Homo sapiens (Human)
Description:
Q13255
Residue:
1194
  
Inhibitor
Name:
BDBM50301520
Synonyms:
4-fluoro-N-(4-(6-(isopropylamino)pyrimidin-4-yl)thiazol-2-yl)-N-methylbenzamide | CHEMBL566581
Type:
Small organic molecule
Emp. Form.:
C18H18FN5OS
Mol. Mass.:
371.432
SMILES:
CC(C)Nc1cc(ncn1)-c1csc(n1)N(C)C(=O)c1ccc(F)cc1
: