Target
Metabotropic glutamate receptor 1
Ligand
BDBM50301817
Substrate
Meas. Tech.
ChEMBL_598101 (CHEMBL1038283)
IC50
250±n/a nM
Citation
 Ito, SHirata, YNagatomi, YSatoh, ASuzuki, GKimura, TSatow, AMaehara, SHikichi, HHata, MOhta, HKawamoto, H Discovery and biological profile of isoindolinone derivatives as novel metabotropic glutamate receptor 1 antagonists: a potential treatment for psychotic disorders. Bioorg Med Chem Lett 19:5310-3 (2009)  
Target
Name:
Metabotropic glutamate receptor 1
Synonyms:
GPRC1A GRM1_HUMAN Metabotropic Glutamate 1a | metabotropic glutamate 1
Type:
Enzyme
Mol. Mass.:
132358.19
Organism:
Homo sapiens (Human)
Description:
Q13255
Residue:
1194
  
Inhibitor
Name:
BDBM50301817
Synonyms:
5-(5-methyl-1-(pyridin-3-yl)-1H-1,2,3-triazol-4-yl)-1H-indole | CHEMBL576637
Type:
Small organic molecule
Emp. Form.:
C16H13N5
Mol. Mass.:
275.3079
SMILES:
Cc1c(nnn1-c1cccnc1)-c1ccc2[nH]ccc2c1
: