Target
Neuronal acetylcholine receptor subunit alpha-7
Ligand
BDBM50036166
Substrate
Meas. Tech.
ChEMBL_595288 (CHEMBL1047082)
Ki
140±n/a nM
Citation
 Grazioso, GPomè, DYMatera, CFrigerio, FPucci, LGotti, CDallanoce, CDe Amici, M Design of novel alpha7-subtype-preferring nicotinic acetylcholine receptor agonists: application of docking and MM-PBSA computational approaches, synthetic and pharmacological studies. Bioorg Med Chem Lett 19:6353-7 (2009)  
Target
Name:
Neuronal acetylcholine receptor subunit alpha-7
Synonyms:
ACHA7_RAT Cholinergic, Nicotinic Alpha7 Chrna7 Neuronal acetylcholine receptor (alpha7 nAChR) Neuronal acetylcholine receptor subunit alpha-7 Neuronal acetylcholine receptor subunit alpha-7 (nAChR)
Type:
Enzyme
Mol. Mass.:
56502.44
Organism:
Rattus norvegicus (Rat)
Description:
Q05941
Residue:
502
  
Inhibitor
Name:
BDBM50036166
Synonyms:
3-(pyridin-3-yl)-1-azabicyclo[2.2.2]oct-2-ene CHEMBL64779
Type:
Small organic molecule
Emp. Form.:
C12H14N2
Mol. Mass.:
186.253
SMILES:
C1CN2CCC1C(=C2)c1cccnc1
: