Target
Neuronal acetylcholine receptor subunit alpha-7
Ligand
BDBM50302793
Substrate
Meas. Tech.
ChEMBL_595288 (CHEMBL1047082)
Ki
6100±n/a nM
Citation
 Grazioso, GPomè, DYMatera, CFrigerio, FPucci, LGotti, CDallanoce, CDe Amici, M Design of novel alpha7-subtype-preferring nicotinic acetylcholine receptor agonists: application of docking and MM-PBSA computational approaches, synthetic and pharmacological studies. Bioorg Med Chem Lett 19:6353-7 (2009)  
Target
Name:
Neuronal acetylcholine receptor subunit alpha-7
Synonyms:
ACHA7_RAT Cholinergic, Nicotinic Alpha7 Chrna7 Neuronal acetylcholine receptor (alpha7 nAChR) Neuronal acetylcholine receptor subunit alpha-7 Neuronal acetylcholine receptor subunit alpha-7 (nAChR)
Type:
Enzyme
Mol. Mass.:
56502.44
Organism:
Rattus norvegicus (Rat)
Description:
Q05941
Residue:
502
  
Inhibitor
Name:
BDBM50302793
Synonyms:
1-methyl-3-(6-morpholinopyridin-3-yl)-1-azoniabicyclo[2.2.2]octane | CHEMBL577968
Type:
Small organic molecule
Emp. Form.:
C17H26N3O
Mol. Mass.:
288.4073
SMILES:
C[N+]12CCC(CC1)C(C2)c1ccc(nc1)N1CCOCC1
: