Target
Neuronal acetylcholine receptor subunit alpha-7
Ligand
BDBM50302797
Substrate
Meas. Tech.
ChEMBL_595288 (CHEMBL1047082)
Ki
33000±n/a nM
Citation
 Grazioso, GPomè, DYMatera, CFrigerio, FPucci, LGotti, CDallanoce, CDe Amici, M Design of novel alpha7-subtype-preferring nicotinic acetylcholine receptor agonists: application of docking and MM-PBSA computational approaches, synthetic and pharmacological studies. Bioorg Med Chem Lett 19:6353-7 (2009)  
Target
Name:
Neuronal acetylcholine receptor subunit alpha-7
Synonyms:
ACHA7_RAT Cholinergic, Nicotinic Alpha7 Chrna7 Neuronal acetylcholine receptor (alpha7 nAChR) Neuronal acetylcholine receptor subunit alpha-7 Neuronal acetylcholine receptor subunit alpha-7 (nAChR)
Type:
Enzyme
Mol. Mass.:
56502.44
Organism:
Rattus norvegicus (Rat)
Description:
Q05941
Residue:
502
  
Inhibitor
Name:
BDBM50302797
Synonyms:
4-(5-(7-azabicyclo[2.2.1]hept-2-en-2-yl)pyridin-2-yl)morpholine | CHEMBL571077
Type:
Small organic molecule
Emp. Form.:
C15H19N3O
Mol. Mass.:
257.3309
SMILES:
C1CC2NC1C=C2c1ccc(nc1)N1CCOCC1
: