Target
Dual specificity protein kinase CLK4
Ligand
BDBM50302983
Substrate
Meas. Tech.
ChEMBL_596744 (CHEMBL1039032)
IC50
126±n/a nM
Citation
 Mott, BTTanega, CShen, MMaloney, DJShinn, PLeister, WMarugan, JJInglese, JAustin, CPMisteli, TAuld, DSThomas, CJ Evaluation of substituted 6-arylquinazolin-4-amines as potent and selective inhibitors of cdc2-like kinases (Clk). Bioorg Med Chem Lett 19:6700-5 (2009)  
Target
Name:
Dual specificity protein kinase CLK4
Synonyms:
CDC-like kinase 4 CLK4_HUMAN | Dual specificity protein kinase CLK1/CLK4
Type:
Serine/threonine-protein kinase
Mol. Mass.:
57522.53
Organism:
Homo sapiens (Human)
Description:
gi_10190706
Residue:
481
  
Inhibitor
Name:
BDBM50302983
Synonyms:
6-(benzo[d][1,3]dioxol-5-yl)-N-(3-fluorobenzyl)quinazolin-4-amine | CHEMBL566722
Type:
Small organic molecule
Emp. Form.:
C22H16FN3O2
Mol. Mass.:
373.3797
SMILES:
Fc1cccc(CNc2ncnc3ccc(cc23)-c2ccc3OCOc3c2)c1
: