Target
Dual specificity protein kinase CLK4
Ligand
BDBM50302987
Substrate
Meas. Tech.
ChEMBL_596744 (CHEMBL1039032)
IC50
631±n/a nM
Citation
 Mott, BTTanega, CShen, MMaloney, DJShinn, PLeister, WMarugan, JJInglese, JAustin, CPMisteli, TAuld, DSThomas, CJ Evaluation of substituted 6-arylquinazolin-4-amines as potent and selective inhibitors of cdc2-like kinases (Clk). Bioorg Med Chem Lett 19:6700-5 (2009)  
Target
Name:
Dual specificity protein kinase CLK4
Synonyms:
CDC-like kinase 4 CLK4_HUMAN | Dual specificity protein kinase CLK1/CLK4
Type:
Serine/threonine-protein kinase
Mol. Mass.:
57522.53
Organism:
Homo sapiens (Human)
Description:
gi_10190706
Residue:
481
  
Inhibitor
Name:
BDBM50302987
Synonyms:
6-(2,3-dihydrobenzo[b][1,4]dioxin-6-yl)-N-(3-methylbenzyl)quinazolin-4-amine | CHEMBL566283
Type:
Small organic molecule
Emp. Form.:
C24H21N3O2
Mol. Mass.:
383.4424
SMILES:
Cc1cccc(CNc2ncnc3ccc(cc23)-c2ccc3OCCOc3c2)c1
: