Target
Dual specificity protein kinase CLK4
Ligand
BDBM50303000
Substrate
Meas. Tech.
ChEMBL_596744 (CHEMBL1039032)
IC50
158±n/a nM
Citation
 Mott, BTTanega, CShen, MMaloney, DJShinn, PLeister, WMarugan, JJInglese, JAustin, CPMisteli, TAuld, DSThomas, CJ Evaluation of substituted 6-arylquinazolin-4-amines as potent and selective inhibitors of cdc2-like kinases (Clk). Bioorg Med Chem Lett 19:6700-5 (2009)  
Target
Name:
Dual specificity protein kinase CLK4
Synonyms:
CDC-like kinase 4 CLK4_HUMAN | Dual specificity protein kinase CLK1/CLK4
Type:
Serine/threonine-protein kinase
Mol. Mass.:
57522.53
Organism:
Homo sapiens (Human)
Description:
gi_10190706
Residue:
481
  
Inhibitor
Name:
BDBM50303000
Synonyms:
6-(3,5-dimethylisoxazol-4-yl)-N-(thiophen-2-ylmethyl)quinazolin-4-amine | CHEMBL568379
Type:
Small organic molecule
Emp. Form.:
C18H16N4OS
Mol. Mass.:
336.411
SMILES:
Cc1noc(C)c1-c1ccc2ncnc(NCc3cccs3)c2c1
: