Target
Dual specificity protein kinase CLK1
Ligand
BDBM80396
Substrate
Meas. Tech.
ChEMBL_596745 (CHEMBL1039033)
Kd
19±n/a nM
Citation
 Mott, BTTanega, CShen, MMaloney, DJShinn, PLeister, WMarugan, JJInglese, JAustin, CPMisteli, TAuld, DSThomas, CJ Evaluation of substituted 6-arylquinazolin-4-amines as potent and selective inhibitors of cdc2-like kinases (Clk). Bioorg Med Chem Lett 19:6700-5 (2009)  
Target
Name:
Dual specificity protein kinase CLK1
Synonyms:
CDC-like kinase 1 CDC2-like kinase 1 (CLK1) CLK1 Dual specificity protein kinase CLK1 Dual specificty protein kinase CLK1
Type:
Protein
Mol. Mass.:
57322.21
Organism:
Homo sapiens (Human)
Description:
P49759
Residue:
484
  
Inhibitor
Name:
BDBM80396
Synonyms:
(1E)-1-(3-ethyl-5-methoxy-1,3-benzothiazol-2-ylidene)-2-propanone (1E)-1-(3-ethyl-5-methoxy-1,3-benzothiazol-2-ylidene)propan-2-one MLS000518915 cid_1893667
Type:
Small organic molecule
Emp. Form.:
C13H15NO2S
Mol. Mass.:
249.329
SMILES:
CCN1C(Sc2ccc(OC)cc12)=CC(C)=O
: