Target
Dual specificity protein kinase CLK1
Ligand
BDBM50302986
Substrate
Meas. Tech.
ChEMBL_596745 (CHEMBL1039033)
Kd
37±n/a nM
Citation
 Mott, BTTanega, CShen, MMaloney, DJShinn, PLeister, WMarugan, JJInglese, JAustin, CPMisteli, TAuld, DSThomas, CJ Evaluation of substituted 6-arylquinazolin-4-amines as potent and selective inhibitors of cdc2-like kinases (Clk). Bioorg Med Chem Lett 19:6700-5 (2009)  
Target
Name:
Dual specificity protein kinase CLK1
Synonyms:
CDC-like kinase 1 CDC2-like kinase 1 (CLK1) CLK1 Dual specificity protein kinase CLK1 Dual specificty protein kinase CLK1
Type:
Protein
Mol. Mass.:
57322.21
Organism:
Homo sapiens (Human)
Description:
P49759
Residue:
484
  
Inhibitor
Name:
BDBM50302986
Synonyms:
6-(benzo[d][1,3]dioxol-5-yl)-N-(thiophen-2-ylmethyl)quinazolin-4-amine | CHEMBL567331
Type:
Small organic molecule
Emp. Form.:
C20H15N3O2S
Mol. Mass.:
361.417
SMILES:
C(Nc1ncnc2ccc(cc12)-c1ccc2OCOc2c1)c1cccs1
: