Target
Dual specificity protein kinase CLK2
Ligand
BDBM50302986
Substrate
Meas. Tech.
ChEMBL_596746 (CHEMBL1039034)
Kd
680±n/a nM
Citation
 Mott, BTTanega, CShen, MMaloney, DJShinn, PLeister, WMarugan, JJInglese, JAustin, CPMisteli, TAuld, DSThomas, CJ Evaluation of substituted 6-arylquinazolin-4-amines as potent and selective inhibitors of cdc2-like kinases (Clk). Bioorg Med Chem Lett 19:6700-5 (2009)  
Target
Name:
Dual specificity protein kinase CLK2
Synonyms:
2.7.12.1 CDC-like kinase 2 (CLK2) CLK2 | CLK2_HUMAN
Type:
Mol. Mass.:
60128.79
Organism:
Homo sapiens (Human)
Description:
P49760
Residue:
499
  
Inhibitor
Name:
BDBM50302986
Synonyms:
6-(benzo[d][1,3]dioxol-5-yl)-N-(thiophen-2-ylmethyl)quinazolin-4-amine | CHEMBL567331
Type:
Small organic molecule
Emp. Form.:
C20H15N3O2S
Mol. Mass.:
361.417
SMILES:
C(Nc1ncnc2ccc(cc12)-c1ccc2OCOc2c1)c1cccs1
: