Target
Dual specificity tyrosine-phosphorylation-regulated kinase 1B
Ligand
BDBM50302986
Substrate
Meas. Tech.
ChEMBL_596754 (CHEMBL1039042)
Kd
430±n/a nM
Citation
 Mott, BTTanega, CShen, MMaloney, DJShinn, PLeister, WMarugan, JJInglese, JAustin, CPMisteli, TAuld, DSThomas, CJ Evaluation of substituted 6-arylquinazolin-4-amines as potent and selective inhibitors of cdc2-like kinases (Clk). Bioorg Med Chem Lett 19:6700-5 (2009)  
Target
Name:
Dual specificity tyrosine-phosphorylation-regulated kinase 1B
Synonyms:
DYR1B_HUMAN Dual specificity tyrosine-phosphorylation-regulated kinase 1B MIRK
Type:
Enzyme
Mol. Mass.:
69222.24
Organism:
Homo sapiens (Human)
Description:
Q9Y463
Residue:
629
  
Inhibitor
Name:
BDBM50302986
Synonyms:
6-(benzo[d][1,3]dioxol-5-yl)-N-(thiophen-2-ylmethyl)quinazolin-4-amine | CHEMBL567331
Type:
Small organic molecule
Emp. Form.:
C20H15N3O2S
Mol. Mass.:
361.417
SMILES:
C(Nc1ncnc2ccc(cc12)-c1ccc2OCOc2c1)c1cccs1
: