Target
Receptor-type tyrosine-protein phosphatase C
Ligand
BDBM50303175
Substrate
Meas. Tech.
ChEMBL_595104 (CHEMBL1047964)
IC50
610±n/a nM
Citation
 Wu, SVossius, SRahmouni, SMiletic, AVVang, TVazquez-Rodriguez, JCerignoli, FArimura, YWilliams, SHayes, TMoutschen, MVasile, SPellecchia, MMustelin, TTautz, L Multidentate small-molecule inhibitors of vaccinia H1-related (VHR) phosphatase decrease proliferation of cervix cancer cells. J Med Chem 52:6716-23 (2009)  
Target
Name:
Receptor-type tyrosine-protein phosphatase C
Synonyms:
CD45 L-CA PTPRC Receptor-type tyrosine-protein phosphatase C (CD45) | T200
Type:
Protein
Mol. Mass.:
147474.19
Organism:
Homo sapiens (Human)
Description:
P08575
Residue:
1306
  
Inhibitor
Name:
BDBM50303175
Synonyms:
2-(5-((3-(4-(benzyloxy)phenyl)-1-phenyl-1H-pyrazol-4-yl)methylene)-4-oxo-2-thioxothiazolidin-3-yl)ethanesulfonic acid cid_4050965
Type:
Small organic molecule
Emp. Form.:
C28H23N3O5S3
Mol. Mass.:
577.694
SMILES:
OS(=O)(=O)CCN1C(=S)S\C(=C/c2cn(nc2-c2ccc(OCc3ccccc3)cc2)-c2ccccc2)C1=O
: