Target
Cruzipain
Ligand
BDBM50303409
Substrate
Meas. Tech.
ChEMBL_595796 (CHEMBL1048803)
Ki
180±n/a nM
Citation
 Mott, BTFerreira, RSSimeonov, AJadhav, AAng, KKLeister, WShen, MSilveira, JTDoyle, PSArkin, MRMcKerrow, JHInglese, JAustin, CPThomas, CJShoichet, BKMaloney, DJ Identification and optimization of inhibitors of Trypanosomal cysteine proteases: cruzain, rhodesain, and TbCatB. J Med Chem 53:52-60 (2010)  
Target
Name:
Cruzipain
Synonyms:
CYSP_TRYCR Cruzaine | Major cysteine proteinase
Type:
Protein
Mol. Mass.:
49831.41
Organism:
Trypanosoma cruzi
Description:
P25779
Residue:
467
  
Inhibitor
Name:
BDBM50303409
Synonyms:
4-amino-6-(diphenylamino)-1,3,5-triazine-2-carbonitrile cid_712283
Type:
Small organic molecule
Emp. Form.:
C16H12N6
Mol. Mass.:
288.3067
SMILES:
Nc1nc(nc(n1)N(c1ccccc1)c1ccccc1)C#N
: