Target
Cannabinoid receptor 1
Ligand
BDBM50303525
Substrate
Meas. Tech.
ChEMBL_596088 (CHEMBL1040876)
Ki
91±n/a nM
Citation
 Frost, JMDart, MJTietje, KRGarrison, TRGrayson, GKDaza, AVEl-Kouhen, OFYao, BBHsieh, GCPai, MZhu, CZChandran, PMeyer, MD Indol-3-ylcycloalkyl ketones: effects of N1 substituted indole side chain variations on CB(2) cannabinoid receptor activity. J Med Chem 53:295-315 (2010)  
Target
Name:
Cannabinoid receptor 1
Synonyms:
CANN6 CB-R CNR CNR1_HUMAN Cannabinoid receptor Cannabinoid receptor 1 (brain)
Type:
G Protein-Coupled Receptor (GPCR)
Mol. Mass.:
52868.96
Organism:
Homo sapiens (Human)
Description:
P21554
Residue:
472
  
Inhibitor
Name:
BDBM50303525
Synonyms:
(1-Butyl-1H-indol-3-yl)(2,2,3,3-tetramethylcyclopropyl)methanone | CHEMBL571550
Type:
Small organic molecule
Emp. Form.:
C20H27NO
Mol. Mass.:
297.4345
SMILES:
CCCCn1cc(C(=O)C2C(C)(C)C2(C)C)c2ccccc12
: