Target
Beta-secretase 1
Ligand
BDBM50303736
Substrate
Meas. Tech.
ChEMBL_597054 (CHEMBL1044549)
IC50
150±n/a nM
Citation
 Malamas, MSErdei, JGunawan, ITurner, JHu, YWagner, EFan, KChopra, ROlland, ABard, JJacobsen, SMagolda, RLPangalos, MRobichaud, AJ Design and synthesis of 5,5'-disubstituted aminohydantoins as potent and selective human beta-secretase (BACE1) inhibitors. J Med Chem 53:1146-58 (2010)  
Target
Name:
Beta-secretase 1
Synonyms:
ASP2 Aspartyl protease 2 BACE1 Beta-secretase (BACE) Beta-secretase 1 (BACE 1) Beta-secretase 1 (BACE1) Beta-site amyloid precursor protein cleaving enzyme 1 Memapsin-2 beta-Secretase (BACE-1) | beta-Secretase (BACE1)
Type:
Protein
Mol. Mass.:
55755.10
Organism:
Homo sapiens (Human)
Description:
P56817
Residue:
501
  
Inhibitor
Name:
BDBM50303736
Synonyms:
5-(2-amino-1-methyl-5-oxo-4-(3-(pyridin-3-yl)phenyl)-4,5-dihydro-1H-imidazol-4-yl)-2-methoxybenzonitrile | CHEMBL568114
Type:
Small organic molecule
Emp. Form.:
C23H19N5O2
Mol. Mass.:
397.4293
SMILES:
COc1ccc(cc1C#N)C1(N=C(N)N(C)C1=O)c1cccc(c1)-c1cccnc1
: