Target
Beta-secretase 1
Ligand
BDBM50303730
Substrate
Meas. Tech.
ChEMBL_597054 (CHEMBL1044549)
IC50
900±n/a nM
Citation
 Malamas, MSErdei, JGunawan, ITurner, JHu, YWagner, EFan, KChopra, ROlland, ABard, JJacobsen, SMagolda, RLPangalos, MRobichaud, AJ Design and synthesis of 5,5'-disubstituted aminohydantoins as potent and selective human beta-secretase (BACE1) inhibitors. J Med Chem 53:1146-58 (2010)  
Target
Name:
Beta-secretase 1
Synonyms:
ASP2 Aspartyl protease 2 BACE1 Beta-secretase (BACE) Beta-secretase 1 (BACE 1) Beta-secretase 1 (BACE1) Beta-site amyloid precursor protein cleaving enzyme 1 Memapsin-2 beta-Secretase (BACE-1) | beta-Secretase (BACE1)
Type:
Protein
Mol. Mass.:
55755.10
Organism:
Homo sapiens (Human)
Description:
P56817
Residue:
501
  
Inhibitor
Name:
BDBM50303730
Synonyms:
2-amino-4-(3-(6-methoxypyridin-3-yl)phenyl)-1-methyl-4-(4-(trifluoromethoxy)phenyl)-1H-imidazol-5(4H)-one | CHEMBL566212
Type:
Small organic molecule
Emp. Form.:
C23H19F3N4O3
Mol. Mass.:
456.4172
SMILES:
COc1ccc(cn1)-c1cccc(c1)C1(N=C(N)N(C)C1=O)c1ccc(OC(F)(F)F)cc1
: