Target
Beta-secretase 1
Ligand
BDBM50303748
Substrate
Meas. Tech.
ChEMBL_597054 (CHEMBL1044549)
IC50
160±n/a nM
Citation
 Malamas, MSErdei, JGunawan, ITurner, JHu, YWagner, EFan, KChopra, ROlland, ABard, JJacobsen, SMagolda, RLPangalos, MRobichaud, AJ Design and synthesis of 5,5'-disubstituted aminohydantoins as potent and selective human beta-secretase (BACE1) inhibitors. J Med Chem 53:1146-58 (2010)  
Target
Name:
Beta-secretase 1
Synonyms:
ASP2 Aspartyl protease 2 BACE1 Beta-secretase (BACE) Beta-secretase 1 (BACE 1) Beta-secretase 1 (BACE1) Beta-site amyloid precursor protein cleaving enzyme 1 Memapsin-2 beta-Secretase (BACE-1) | beta-Secretase (BACE1)
Type:
Protein
Mol. Mass.:
55755.10
Organism:
Homo sapiens (Human)
Description:
P56817
Residue:
501
  
Inhibitor
Name:
BDBM50303748
Synonyms:
(S)-5-Adamantan-1-yl-2-amino-5-(4-methoxy-phenyl)-3-methyl-3,5-dihydro-imidazol-4-one | CHEMBL585128
Type:
Small organic molecule
Emp. Form.:
C21H27N3O2
Mol. Mass.:
353.458
SMILES:
COc1ccc(cc1)[C@@]1(N=C(N)N(C)C1=O)C12CC3CC(CC(C3)C1)C2
: