Target
Beta-secretase 1
Ligand
BDBM50303725
Substrate
Meas. Tech.
ChEMBL_597054 (CHEMBL1044549)
IC50
630±n/a nM
Citation
 Malamas, MSErdei, JGunawan, ITurner, JHu, YWagner, EFan, KChopra, ROlland, ABard, JJacobsen, SMagolda, RLPangalos, MRobichaud, AJ Design and synthesis of 5,5'-disubstituted aminohydantoins as potent and selective human beta-secretase (BACE1) inhibitors. J Med Chem 53:1146-58 (2010)  
Target
Name:
Beta-secretase 1
Synonyms:
ASP2 Aspartyl protease 2 BACE1 Beta-secretase (BACE) Beta-secretase 1 (BACE 1) Beta-secretase 1 (BACE1) Beta-site amyloid precursor protein cleaving enzyme 1 Memapsin-2 beta-Secretase (BACE-1) | beta-Secretase (BACE1)
Type:
Protein
Mol. Mass.:
55755.10
Organism:
Homo sapiens (Human)
Description:
P56817
Residue:
501
  
Inhibitor
Name:
BDBM50303725
Synonyms:
4-(2-amino-4-(4-methoxy-3-methylphenyl)-1-methyl-5-oxo-4,5-dihydro-1H-imidazol-4-yl)-2-(pyridin-3-yl)benzonitrile | CHEMBL565378
Type:
Small organic molecule
Emp. Form.:
C24H21N5O2
Mol. Mass.:
411.4558
SMILES:
COc1ccc(cc1C)C1(N=C(N)N(C)C1=O)c1ccc(C#N)c(c1)-c1cccnc1
: