Target
Beta-secretase 1
Ligand
BDBM50300229
Substrate
Meas. Tech.
ChEMBL_597054 (CHEMBL1044549)
IC50
3440±n/a nM
Citation
 Malamas, MSErdei, JGunawan, ITurner, JHu, YWagner, EFan, KChopra, ROlland, ABard, JJacobsen, SMagolda, RLPangalos, MRobichaud, AJ Design and synthesis of 5,5'-disubstituted aminohydantoins as potent and selective human beta-secretase (BACE1) inhibitors. J Med Chem 53:1146-58 (2010)  
Target
Name:
Beta-secretase 1
Synonyms:
ASP2 Aspartyl protease 2 BACE1 Beta-secretase (BACE) Beta-secretase 1 (BACE 1) Beta-secretase 1 (BACE1) Beta-site amyloid precursor protein cleaving enzyme 1 Memapsin-2 beta-Secretase (BACE-1) | beta-Secretase (BACE1)
Type:
Protein
Mol. Mass.:
55755.10
Organism:
Homo sapiens (Human)
Description:
P56817
Residue:
501
  
Inhibitor
Name:
BDBM50300229
Synonyms:
1-methyl-4,4-diphenyl-4,5-dihydro-1H-imidazol-2-amine 2-amino-1-methyl-4,4-diphenyl-1H-imidazol-5(4H)-one CHEMBL291784
Type:
Small organic molecule
Emp. Form.:
C16H15N3O
Mol. Mass.:
265.3098
SMILES:
CN1C(N)=NC(C1=O)(c1ccccc1)c1ccccc1
: