Target
Beta-secretase 1
Ligand
BDBM50303740
Substrate
Meas. Tech.
ChEMBL_597054 (CHEMBL1044549)
IC50
3470±n/a nM
Citation
 Malamas, MSErdei, JGunawan, ITurner, JHu, YWagner, EFan, KChopra, ROlland, ABard, JJacobsen, SMagolda, RLPangalos, MRobichaud, AJ Design and synthesis of 5,5'-disubstituted aminohydantoins as potent and selective human beta-secretase (BACE1) inhibitors. J Med Chem 53:1146-58 (2010)  
Target
Name:
Beta-secretase 1
Synonyms:
ASP2 Aspartyl protease 2 BACE1 Beta-secretase (BACE) Beta-secretase 1 (BACE 1) Beta-secretase 1 (BACE1) Beta-site amyloid precursor protein cleaving enzyme 1 Memapsin-2 beta-Secretase (BACE-1) | beta-Secretase (BACE1)
Type:
Protein
Mol. Mass.:
55755.10
Organism:
Homo sapiens (Human)
Description:
P56817
Residue:
501
  
Inhibitor
Name:
BDBM50303740
Synonyms:
2-amino-4-(3-methoxyphenyl)-1-methyl-4-phenyl-1H-imidazol-5(4H)-one | CHEMBL576628
Type:
Small organic molecule
Emp. Form.:
C17H17N3O2
Mol. Mass.:
295.3358
SMILES:
COc1cccc(c1)C1(N=C(N)N(C)C1=O)c1ccccc1
: