Target
Cannabinoid receptor 1
Ligand
BDBM29094
Substrate
Meas. Tech.
ChEMBL_594777 (CHEMBL1040738)
Ki
25±n/a nM
Citation
 Lange, JHCoolen, HKvan der Neut, MABorst, AJStork, BVerveer, PCKruse, CG Design, synthesis, biological properties, and molecular modeling investigations of novel tacrine derivatives with a combination of acetylcholinesterase inhibition and cannabinoid CB1 receptor antagonism. J Med Chem 53:1338-46 (2010)  
Target
Name:
Cannabinoid receptor 1
Synonyms:
CANN6 CB-R CNR CNR1_HUMAN Cannabinoid receptor Cannabinoid receptor 1 (brain)
Type:
G Protein-Coupled Receptor (GPCR)
Mol. Mass.:
52868.96
Organism:
Homo sapiens (Human)
Description:
P21554
Residue:
472
  
Inhibitor
Name:
BDBM29094
Synonyms:
(+/-)-SLV319 3-(4-chlorophenyl)-N''''-(4-chlorophenylsulfonyl)-N-methyl-4-phenyl-4,5-dihydro-1H-pyrazole-1-carboximidamide CHEMBL158784 ibipinabant
Type:
Small organic molecule
Emp. Form.:
C23H20Cl2N4O2S
Mol. Mass.:
487.402
SMILES:
CN=C(NS(=O)(=O)c1ccc(Cl)cc1)N1CC(C(=N1)c1ccc(Cl)cc1)c1ccccc1
: