Target
Fructose-1,6-bisphosphatase 1
Ligand
BDBM50303887
Substrate
Meas. Tech.
ChEMBL_595157 (CHEMBL1037322)
IC50
1500±n/a nM
Citation
 Dang, QKasibhatla, SRXiao, WLiu, YDare, JTaplin, FReddy, KRScarlato, GRGibson, Tvan Poelje, PDPotter, SCErion, MD Fructose-1,6-bisphosphatase Inhibitors. 2. Design, synthesis, and structure-activity relationship of a series of phosphonic acid containing benzimidazoles that function as 5'-adenosinemonophosphate (AMP) mimics. J Med Chem 53:441-51 (2010)  
Target
Name:
Fructose-1,6-bisphosphatase 1
Synonyms:
D-fructose-1,6-bisphosphate 1-phosphohydrolase 1 FBP FBPase 1 Fructose-1,6-bisphosphatase 1 | Fructose-1,6-bisphosphatase 1 (FBPase)
Type:
Protein
Mol. Mass.:
36843.58
Organism:
Homo sapiens (Human)
Description:
Liver FBPase (P09467)
Residue:
338
  
Inhibitor
Name:
BDBM50303887
Synonyms:
4-Amino-1-cyclopentylmethyl-2-[2-(5-phosphono)furanyl]benzimidazole | CHEMBL571879
Type:
Small organic molecule
Emp. Form.:
C17H20N3O4P
Mol. Mass.:
361.3322
SMILES:
Nc1cccc2n(CC3CCCC3)c(nc12)-c1ccc(o1)P(O)(O)=O
: