Target
Glycine receptor subunit alpha-1
Ligand
BDBM50415204
Substrate
Meas. Tech.
ChEMBL_606507 (CHEMBL1065458)
IC50
41.69±n/a nM
Citation
 Maksay, GVincze, ZNemes, P Synthesis of heteroaromatic tropeines and heterogeneous binding to glycine receptors. Bioorg Med Chem 17:6872-8 (2009)  
Target
Name:
Glycine receptor subunit alpha-1
Synonyms:
GLRA1_RAT Glycine receptor alpha-1 chain Glycine, non-strychnine Glyr
Type:
Enzyme Catalytic Domain
Mol. Mass.:
52629.37
Organism:
RAT
Description:
Glycine, non-strychnine 0 RAT::P07727
Residue:
457
  
Inhibitor
Name:
BDBM50415204
Synonyms:
CHEMBL596443
Type:
Small organic molecule
Emp. Form.:
C12H15NO2S
Mol. Mass.:
237.318
SMILES:
O=C(OC1C[C@H]2CC[C@H](C1)N2)c1cccs1
: