Target
Histamine H1 receptor
Ligand
BDBM50304528
Substrate
Meas. Tech.
ChEMBL_604062 (CHEMBL1046851)
Ki
>1000±n/a nM
Citation
 Sander, KKottke, TTanrikulu, YProschak, EWeizel, LSchneider, EHSeifert, RSchneider, GStark, H 2,4-Diaminopyrimidines as histamine H4 receptor ligands--Scaffold optimization and pharmacological characterization. Bioorg Med Chem 17:7186-96 (2009)  
Target
Name:
Histamine H1 receptor
Synonyms:
H1R HISTAMINE H1 HRH1_HUMAN
Type:
G Protein-Coupled Receptor (GPCR)
Mol. Mass.:
55808.72
Organism:
Homo sapiens (Human)
Description:
Cell pellets from SK-N-MC cells transfected with human H1 receptor were used in binding assay.
Residue:
487
  
Inhibitor
Name:
BDBM50304528
Synonyms:
CHEMBL593103 | N4-(4-Fluorobenzyl)-6-(4-methylpiperazin-1-yl)pyrimidine-2,4-diamine
Type:
Small organic molecule
Emp. Form.:
C16H21FN6
Mol. Mass.:
316.3765
SMILES:
CN1CCN(CC1)c1cc(NCc2ccc(F)cc2)nc(N)n1
: