Target
Vitamin D3 receptor
Ligand
BDBM50304585
Substrate
Meas. Tech.
ChEMBL_606218 (CHEMBL1067951)
Ki
0.02±n/a nM
Citation
 Barycki, RSicinski, RRPlum, LAGrzywacz, PClagett-Dame, MDeluca, HF Removal of the 20-methyl group from 2-methylene-19-nor-(20S)-1alpha,25-dihydroxyvitamin D(3) (2MD) selectively eliminates bone calcium mobilization activity. Bioorg Med Chem 17:7658-69 (2009)  
Target
Name:
Vitamin D3 receptor
Synonyms:
Nr1i1 Vdr | Vitamin D receptor
Type:
PROTEIN
Mol. Mass.:
47811.07
Organism:
Rattus norvegicus
Description:
ChEMBL_1505946
Residue:
423
  
Inhibitor
Name:
BDBM50304585
Synonyms:
(20S)-1alpha,25-Dihydroxy-2-methylene-18,19-dinorvitamin D3 | CHEMBL596532
Type:
Small organic molecule
Emp. Form.:
C26H42O3
Mol. Mass.:
402.6099
SMILES:
[#6]-[#6@@H](-[#6]-[#6]-[#6]C([#6])([#6])[#8])-[#6@H]-1-[#6]-[#6]-[#6@@H]2-[#6@@H]-1-[#6]-[#6]-[#6]\[#6]-2=[#6]/[#6]=[#6]-1/[#6]-[#6@@H](-[#8])-[#6](=[#6])-[#6@H](-[#8])-[#6]-1
: