Target
Prostaglandin E synthase
Ligand
BDBM31140
Substrate
Meas. Tech.
ChEMBL_604678 (CHEMBL1068501)
IC50
1700±n/a nM
Citation
 Koeberle, AHaberl, EMRossi, APergola, CDehm, FNorthoff, HTroschuetz, RSautebin, LWerz, O Discovery of benzo[g]indol-3-carboxylates as potent inhibitors of microsomal prostaglandin E(2) synthase-1. Bioorg Med Chem 17:7924-32 (2009)  
Target
Name:
Prostaglandin E synthase
Synonyms:
MGST1L1 PGES PTGES Prostaglandin E synthase (PGES-1) Prostaglandin E synthase-1 (PGES-1) Prostaglandin E2 synthase-1 ( mPGES-1)
Type:
Protein
Mol. Mass.:
17112.22
Organism:
Homo sapiens (Human)
Description:
Residue:
152
  
Inhibitor
Name:
BDBM31140
Synonyms:
1H-benzo[g]indole-3-carboxylate, 19
Type:
Small organic molecule
Emp. Form.:
C24H22ClNO5
Mol. Mass.:
439.888
SMILES:
CCOC(=O)c1c(Cc2cccc(Cl)c2)[nH]c2c1cc(O)c1cc(OC)c(OC)cc21
: