Target
Transient receptor potential cation channel subfamily V member 1
Ligand
BDBM50304761
Substrate
Meas. Tech.
ChEMBL_605565 (CHEMBL1067319)
IC50
55±n/a nM
Citation
 Li, FNKim, NJChang, DJJang, JJang, HJung, JWMin, KHJeong, YSKim, SYPark, YHKim, HDPark, HGSuh, YG Synthesis and structural optimization of multiple H-bonding region of diarylalkyl (thio)amides as novel TRPV1 antagonists. Bioorg Med Chem 17:8149-60 (2009)  
Target
Name:
Transient receptor potential cation channel subfamily V member 1
Synonyms:
Capsaicin receptor TRPV1_RAT Trpv1 Vanilloid VR1 Vanilloid receptor 1 (VRI/TRPV1) Vanilloid receptor type 1-like (TrpV1/Vr1) Vr1l | osm-9-like TRP channel 1
Type:
Transient Receptor
Mol. Mass.:
94956.12
Organism:
Rattus norvegicus (rat)
Description:
O35433
Residue:
838
  
Inhibitor
Name:
BDBM50304761
Synonyms:
3-(4-tert-Butylphenyl)-N-[3-cyano-4-(methylsulfonamido)benzyl]propanethioamide | CHEMBL610756
Type:
Small organic molecule
Emp. Form.:
C22H27N3O2S2
Mol. Mass.:
429.599
SMILES:
CC(C)(C)c1ccc(CCC(=S)NCc2ccc(NS(C)(=O)=O)c(c2)C#N)cc1
: