Target
Histone deacetylase 5
Ligand
BDBM50304783
Substrate
Meas. Tech.
ChEMBL_605915 (CHEMBL1068532)
IC50
22±n/a nM
Citation
 Angibaud, PVan Emelen, KDecrane, Lvan Brandt, STen Holte, PPilatte, IRoux, BPoncelet, VSpeybrouck, DQueguiner, LGaurrand, SMariën, AFloren, WJanssen, LVerdonck, Mvan Dun, Jvan Gompel, JGilissen, RMackie, CDu Jardin, MPeeters, JNoppe, MVan Hijfte, LFreyne, EPage, MJanicot, MArts, J Identification of a series of substituted 2-piperazinyl-5-pyrimidylhydroxamic acids as potent histone deacetylase inhibitors. Bioorg Med Chem Lett 20:294-8 (2010)  
Target
Name:
Histone deacetylase 5
Synonyms:
Antigen NY-CO-9 HDAC5 Histone acetylase 5 (HDAC5) Human HDAC5 | KIAA0600
Type:
Enzyme
Mol. Mass.:
121968.61
Organism:
Homo sapiens (Human)
Description:
Q9UQL6
Residue:
1122
  
Inhibitor
Name:
BDBM50304783
Synonyms:
(+)-2-(4-(4-(4-fluorophenyl)-1-hydroxybut-3-en-2-yl)piperazin-1-yl)-N-hydroxypyrimidine-5-carboxamide 2-(4-(4-(4-fluorophenyl)-1-hydroxybut-3-en-2-yl)piperazin-1-yl)-N-hydroxypyrimidine-5-carboxamide | CHEMBL594544
Type:
Small organic molecule
Emp. Form.:
C19H22FN5O3
Mol. Mass.:
387.4081
SMILES:
OCC(\C=C\c1ccc(F)cc1)N1CCN(CC1)c1ncc(cn1)C(=O)NO
: