Target
Histone deacetylase 2
Ligand
BDBM50304782
Substrate
Meas. Tech.
ChEMBL_605911 (CHEMBL1068528)
IC50
9±n/a nM
Citation
 Angibaud, PVan Emelen, KDecrane, Lvan Brandt, STen Holte, PPilatte, IRoux, BPoncelet, VSpeybrouck, DQueguiner, LGaurrand, SMariën, AFloren, WJanssen, LVerdonck, Mvan Dun, Jvan Gompel, JGilissen, RMackie, CDu Jardin, MPeeters, JNoppe, MVan Hijfte, LFreyne, EPage, MJanicot, MArts, J Identification of a series of substituted 2-piperazinyl-5-pyrimidylhydroxamic acids as potent histone deacetylase inhibitors. Bioorg Med Chem Lett 20:294-8 (2010)  
Target
Name:
Histone deacetylase 2
Synonyms:
Cereblon/Histone deacetylase 2 HDAC2 Histone deacetylase 2 (HDAC2) | Human HDAC2
Type:
Chromatin regulator; hydrolase; repressor
Mol. Mass.:
55356.54
Organism:
Homo sapiens (Human)
Description:
Q92769
Residue:
488
  
Inhibitor
Name:
BDBM50304782
Synonyms:
CHEMBL609583 | N-hydroxy-2-(4-(naphthalen-2-ylsulfonyl)piperazin-1-yl)pyrimidine-5-carboxamide
Type:
Small organic molecule
Emp. Form.:
C19H19N5O4S
Mol. Mass.:
413.45
SMILES:
ONC(=O)c1cnc(nc1)N1CCN(CC1)S(=O)(=O)c1ccc2ccccc2c1
: