Target
Histone deacetylase 3
Ligand
BDBM50304782
Substrate
Meas. Tech.
ChEMBL_605912 (CHEMBL1068529)
IC50
9±n/a nM
Citation
 Angibaud, PVan Emelen, KDecrane, Lvan Brandt, STen Holte, PPilatte, IRoux, BPoncelet, VSpeybrouck, DQueguiner, LGaurrand, SMariën, AFloren, WJanssen, LVerdonck, Mvan Dun, Jvan Gompel, JGilissen, RMackie, CDu Jardin, MPeeters, JNoppe, MVan Hijfte, LFreyne, EPage, MJanicot, MArts, J Identification of a series of substituted 2-piperazinyl-5-pyrimidylhydroxamic acids as potent histone deacetylase inhibitors. Bioorg Med Chem Lett 20:294-8 (2010)  
Target
Name:
Histone deacetylase 3
Synonyms:
HD3 HDAC3_HUMAN Human HDAC3 SMAP45
Type:
Enzyme
Mol. Mass.:
48829.55
Organism:
Homo sapiens (Human)
Description:
O15379
Residue:
428
  
Inhibitor
Name:
BDBM50304782
Synonyms:
CHEMBL609583 | N-hydroxy-2-(4-(naphthalen-2-ylsulfonyl)piperazin-1-yl)pyrimidine-5-carboxamide
Type:
Small organic molecule
Emp. Form.:
C19H19N5O4S
Mol. Mass.:
413.45
SMILES:
ONC(=O)c1cnc(nc1)N1CCN(CC1)S(=O)(=O)c1ccc2ccccc2c1
: