Target
Polyamine deacetylase HDAC10
Ligand
BDBM50304783
Substrate
Meas. Tech.
ChEMBL_605919 (CHEMBL1068536)
IC50
43±n/a nM
Citation
 Angibaud, PVan Emelen, KDecrane, Lvan Brandt, STen Holte, PPilatte, IRoux, BPoncelet, VSpeybrouck, DQueguiner, LGaurrand, SMariën, AFloren, WJanssen, LVerdonck, Mvan Dun, Jvan Gompel, JGilissen, RMackie, CDu Jardin, MPeeters, JNoppe, MVan Hijfte, LFreyne, EPage, MJanicot, MArts, J Identification of a series of substituted 2-piperazinyl-5-pyrimidylhydroxamic acids as potent histone deacetylase inhibitors. Bioorg Med Chem Lett 20:294-8 (2010)  
Target
Name:
Polyamine deacetylase HDAC10
Synonyms:
HD10 HDAC10 Histone deacetylase 10 | Human HDAC10
Type:
Chromatin regulator; hydrolase; repressor
Mol. Mass.:
71431.89
Organism:
Homo sapiens (Human)
Description:
Q969S8
Residue:
669
  
Inhibitor
Name:
BDBM50304783
Synonyms:
(+)-2-(4-(4-(4-fluorophenyl)-1-hydroxybut-3-en-2-yl)piperazin-1-yl)-N-hydroxypyrimidine-5-carboxamide 2-(4-(4-(4-fluorophenyl)-1-hydroxybut-3-en-2-yl)piperazin-1-yl)-N-hydroxypyrimidine-5-carboxamide | CHEMBL594544
Type:
Small organic molecule
Emp. Form.:
C19H22FN5O3
Mol. Mass.:
387.4081
SMILES:
OCC(\C=C\c1ccc(F)cc1)N1CCN(CC1)c1ncc(cn1)C(=O)NO
: