Target
cGMP-specific 3',5'-cyclic phosphodiesterase
Ligand
BDBM50246252
Substrate
Meas. Tech.
ChEMBL_605926 (CHEMBL1068543)
IC50
1±n/a nM
Citation
 Choi, HLee, JKim, YHIm, DSHwang, ICKim, SJMoon, SKLee, HWLee, SSAhn, SKKim, SWChoi, NSLee, KJ Discovery of potent, selective, and orally bioavailable PDE5 inhibitor: Methyl-4-(3-chloro-4-methoxybenzylamino)-8-(2-hydroxyethyl)-7-methoxyquinazolin-6-ylmethylcarbamate (CKD 533). Bioorg Med Chem Lett 20:383-6 (2010)  
Target
Name:
cGMP-specific 3',5'-cyclic phosphodiesterase
Synonyms:
PDE5 PDE5A_BOVIN | Phosphodiesterase 5A
Type:
PROTEIN
Mol. Mass.:
98615.45
Organism:
Bos taurus
Description:
ChEMBL_155186
Residue:
865
  
Inhibitor
Name:
BDBM50246252
Synonyms:
CHEMBL521075 | N-(4-(3-chloro-4-methoxybenzylamino)-8-(2-hydroxyethyl)-7-methoxyquinazolin-6-yl)propionamide
Type:
Small organic molecule
Emp. Form.:
C22H25ClN4O4
Mol. Mass.:
444.911
SMILES:
CCC(=O)Nc1cc2c(NCc3ccc(OC)c(Cl)c3)ncnc2c(CCO)c1OC
: