Target
Papain
Ligand
BDBM50304795
Substrate
Meas. Tech.
ChEMBL_606254 (CHEMBL1069944)
Ki
42±n/a nM
Citation
 Löser, RGut, JRosenthal, PJFrizler, MGütschow, MAndrews, KT Antimalarial activity of azadipeptide nitriles. Bioorg Med Chem Lett 20:252-5 (2010)  
Target
Name:
Papain
Synonyms:
Allergen=Car p 1 PPI | Papaya proteinase I
Type:
Enzyme
Mol. Mass.:
38923.01
Organism:
Carica papaya
Description:
Papain was purchased from Sigma, Germany.
Residue:
345
  
Inhibitor
Name:
BDBM50304795
Synonyms:
(S)-benzyl 1-(2-benzyl-2-cyano-1-methylhydrazinyl)-1-oxo-3-phenylpropan-2-ylcarbamate acs.jmedchem.1c00409_ST.404
Type:
Small organic molecule
Emp. Form.:
C26H26N4O3
Mol. Mass.:
442.5096
SMILES:
CN(N(Cc1ccccc1)C#N)C(=O)[C@H](Cc1ccccc1)NC(=O)OCc1ccccc1
: