Target
5-hydroxytryptamine receptor 2C
Ligand
BDBM50304813
Substrate
Meas. Tech.
ChEMBL_606255 (CHEMBL1069945)
EC50
1360±n/a nM
Citation
 Liu, KKCornelius, PPatterson, TAZeng, YSantucci, STomlinson, EGibbons, CMaurer, TSMarala, RBrown, JKong, JXLee, EWerner, WWenzel, ZVage, C Design and synthesis of orally-active and selective azaindane 5HT2c agonist for the treatment of obesity. Bioorg Med Chem Lett 20:266-71 (2010)  
Target
Name:
5-hydroxytryptamine receptor 2C
Synonyms:
5-HT-1C 5-HT1C 5-HT2C-INI 5-HTR2C 5-hydroxytryptamine receptor 2C (5-HT-2C) 5HT-1C HTR1C Serotonin (5-HT3) receptor Serotonin Receptor 2C
Type:
G Protein-Coupled Receptor (GPCR)
Mol. Mass.:
51836.79
Organism:
Homo sapiens (Human)
Description:
P28335
Residue:
458
  
Inhibitor
Name:
BDBM50304813
Synonyms:
6-bromo-8-(piperazin-1-yl)imidazo[1,2-a]pyrazine | CHEMBL609595
Type:
Small organic molecule
Emp. Form.:
C10H12BrN5
Mol. Mass.:
282.14
SMILES:
Brc1cn2ccnc2c(n1)N1CCNCC1
: