Target
Metabotropic glutamate receptor 5
Ligand
BDBM50305030
Substrate
Meas. Tech.
ChEMBL_602837 (CHEMBL1065281)
IC50
2300±n/a nM
Citation
 Spanka, CGlatthar, RDesrayaud, SFendt, MOrain, DTroxler, TVranesic, I Piperidyl amides as novel, potent and orally active mGlu5 receptor antagonists with anxiolytic-like activity. Bioorg Med Chem Lett 20:184-8 (2010)  
Target
Name:
Metabotropic glutamate receptor 5
Synonyms:
GPRC1E GRM5_HUMAN metabotropic glutamate 5 | metabotropic glutamate 5a
Type:
Enzyme
Mol. Mass.:
132484.72
Organism:
Homo sapiens (Human)
Description:
Residue:
1212
  
Inhibitor
Name:
BDBM50305030
Synonyms:
(6-(4-fluorophenylamino)pyridin-3-yl)(piperidin-1-yl)methanone | CHEMBL592904
Type:
Small organic molecule
Emp. Form.:
C17H18FN3O
Mol. Mass.:
299.3427
SMILES:
Fc1ccc(Nc2ccc(cn2)C(=O)N2CCCCC2)cc1
: