Target
Beta-secretase 1
Ligand
BDBM50305531
Substrate
Meas. Tech.
ChEMBL_604240 (CHEMBL1050385)
IC50
2±n/a nM
Citation
 Lerchner, AMachauer, RBetschart, CVeenstra, SRueeger, HMcCarthy, CTintelnot-Blomley, MJaton, ALRabe, SDesrayaud, SEnz, AStaufenbiel, MPaganetti, PRondeau, JMNeumann, U Macrocyclic BACE-1 inhibitors acutely reduce Abeta in brain after po application. Bioorg Med Chem Lett 20:603-7 (2010)  
Target
Name:
Beta-secretase 1
Synonyms:
ASP2 Aspartyl protease 2 BACE1 Beta-secretase (BACE) Beta-secretase 1 (BACE 1) Beta-secretase 1 (BACE1) Beta-site amyloid precursor protein cleaving enzyme 1 Memapsin-2 beta-Secretase (BACE-1) | beta-Secretase (BACE1)
Type:
Protein
Mol. Mass.:
55755.10
Organism:
Homo sapiens (Human)
Description:
P56817
Residue:
501
  
Inhibitor
Name:
BDBM50305531
Synonyms:
CHEMBL595136 | Propane-1-sulfonic acid((S)-4-{(R)-1-hydroxy-2-[1-(3-isopropyl-phenyl)-cyclopropylamino]-ethyl}-2-oxo-11-oxa-3,16-diaza-tricyclo[15.3.1.1*6,10*]docosa-1(21),6(22),7,9,17,19-hexaen-19-yl)-methyl-amide
Type:
Small organic molecule
Emp. Form.:
C37H50N4O5S
Mol. Mass.:
662.882
SMILES:
CCCS(=O)(=O)N(C)c1cc2NCCCCOc3cccc(C[C@H](NC(=O)c(c2)c1)[C@H](O)CNC1(CC1)c1cccc(c1)C(C)C)c3
: