Target
C-C chemokine receptor type 5
Ligand
BDBM50305791
Substrate
Meas. Tech.
ChEMBL_604792 (CHEMBL1072586)
IC50
10±n/a nM
Citation
 Lemoine, RCPetersen, ACSetti, LWanner, JJekle, AHeilek, GdeRosier, AJi, CBerry, PRotstein, D Evaluation of secondary amide replacements in a series of CCR5 antagonists as a means to increase intrinsic membrane permeability. Part 1: Optimization of gem-disubstituted azacycles. Bioorg Med Chem Lett 20:704-8 (2010)  
Target
Name:
C-C chemokine receptor type 5
Synonyms:
C-C CKR-5 CC-CKR-5 CCR5 CCR5_HUMAN CHEMR13 HIV-1 fusion coreceptor
Type:
Enzyme
Mol. Mass.:
40540.21
Organism:
Homo sapiens (Human)
Description:
P51681
Residue:
352
  
Inhibitor
Name:
BDBM50305791
Synonyms:
((3aR,6aS)-5-(2-(1-(4,4-difluorocyclohexanecarbonyl)-3-phenylazetidin-3-yl)ethyl)hexahydropyrrolo[3,4-c]pyrrol-2(1H)-yl)(4,6-dimethylpyrimidin-5-yl)methanone | CHEMBL592940
Type:
Small organic molecule
Emp. Form.:
C31H39F2N5O2
Mol. Mass.:
551.6705
SMILES:
Cc1ncnc(C)c1C(=O)N1C[C@@H]2CN(CCC3(CN(C3)C(=O)C3CCC(F)(F)CC3)c3ccccc3)C[C@@H]2C1
: