Target
Metabotropic glutamate receptor 7
Ligand
BDBM50305866
Substrate
Meas. Tech.
ChEMBL_605281 (CHEMBL1069931)
IC50
240±n/a nM
Citation
 Nakamura, MKurihara, HSuzuki, GMitsuya, MOhkubo, MOhta, H Isoxazolopyridone derivatives as allosteric metabotropic glutamate receptor 7 antagonists. Bioorg Med Chem Lett 20:726-9 (2010)  
Target
Name:
Metabotropic glutamate receptor 7
Synonyms:
GRM7_RAT Grm7 Metabotropic glutamate receptor 7 (mGlu7) mGlu7
Type:
Enzyme
Mol. Mass.:
102244.48
Organism:
Rattus norvegicus (Rat)
Description:
P35400
Residue:
915
  
Inhibitor
Name:
BDBM50305866
Synonyms:
5-methyl-6-phenyl-3-(pyridin-3-yl)isoxazolo[4,5-c]pyridin-4(5H)-one | CHEMBL596274
Type:
Small organic molecule
Emp. Form.:
C18H13N3O2
Mol. Mass.:
303.3147
SMILES:
Cn1c(cc2onc(-c3cccnc3)c2c1=O)-c1ccccc1
: