Target
Metabotropic glutamate receptor 7
Ligand
BDBM50305872
Substrate
Meas. Tech.
ChEMBL_605281 (CHEMBL1069931)
IC50
150±n/a nM
Citation
 Nakamura, MKurihara, HSuzuki, GMitsuya, MOhkubo, MOhta, H Isoxazolopyridone derivatives as allosteric metabotropic glutamate receptor 7 antagonists. Bioorg Med Chem Lett 20:726-9 (2010)  
Target
Name:
Metabotropic glutamate receptor 7
Synonyms:
GRM7_RAT Grm7 Metabotropic glutamate receptor 7 (mGlu7) mGlu7
Type:
Enzyme
Mol. Mass.:
102244.48
Organism:
Rattus norvegicus (Rat)
Description:
P35400
Residue:
915
  
Inhibitor
Name:
BDBM50305872
Synonyms:
5-methyl-3-phenyl-6-(4-propylphenyl)isoxazolo[4,5-c]pyridin-4(5H)-one | CHEMBL595388
Type:
Small organic molecule
Emp. Form.:
C22H20N2O2
Mol. Mass.:
344.4064
SMILES:
CCCc1ccc(cc1)-c1cc2onc(-c3ccccc3)c2c(=O)n1C
: