Target
Metabotropic glutamate receptor 7
Ligand
BDBM50305875
Substrate
Meas. Tech.
ChEMBL_605281 (CHEMBL1069931)
IC50
210±n/a nM
Citation
 Nakamura, MKurihara, HSuzuki, GMitsuya, MOhkubo, MOhta, H Isoxazolopyridone derivatives as allosteric metabotropic glutamate receptor 7 antagonists. Bioorg Med Chem Lett 20:726-9 (2010)  
Target
Name:
Metabotropic glutamate receptor 7
Synonyms:
GRM7_RAT Grm7 Metabotropic glutamate receptor 7 (mGlu7) mGlu7
Type:
Enzyme
Mol. Mass.:
102244.48
Organism:
Rattus norvegicus (Rat)
Description:
P35400
Residue:
915
  
Inhibitor
Name:
BDBM50305875
Synonyms:
6-(3-fluoro-4-methoxyphenyl)-5-methyl-3-phenylisoxazolo[4,5-c]pyridin-4(5H)-one | CHEMBL594648
Type:
Small organic molecule
Emp. Form.:
C20H15FN2O3
Mol. Mass.:
350.3431
SMILES:
COc1ccc(cc1F)-c1cc2onc(-c3ccccc3)c2c(=O)n1C
: