Target
Free fatty acid receptor 2
Ligand
BDBM50305954
Substrate
Meas. Tech.
ChEMBL_605612 (CHEMBL1069216)
IC50
2300±n/a nM
Citation
 Wang, YJiao, XKayser, FLiu, JWang, ZWanska, MGreenberg, JWeiszmann, JGe, HTian, HWong, SSchwandner, RLee, TLi, Y The first synthetic agonists of FFA2: Discovery and SAR of phenylacetamides as allosteric modulators. Bioorg Med Chem Lett 20:493-8 (2010)  
Target
Name:
Free fatty acid receptor 2
Synonyms:
FFA2 FFAR2_HUMAN GPCR43 | GPR43
Type:
PROTEIN
Mol. Mass.:
37156.44
Organism:
Homo sapiens (Human)
Description:
ChEMBL_1508993
Residue:
330
  
Inhibitor
Name:
BDBM50305954
Synonyms:
(S)-2-(4-chlorophenyl)-3-methyl-N-(pyridazin-3-yl)butanamide | CHEMBL593435
Type:
Small organic molecule
Emp. Form.:
C15H16ClN3O
Mol. Mass.:
289.76
SMILES:
CC(C)[C@H](C(=O)Nc1cccnn1)c1ccc(Cl)cc1
: