Target
Cathepsin K
Ligand
BDBM50306302
Substrate
Meas. Tech.
ChEMBL_609281 (CHEMBL1070042)
IC50
0.4±n/a nM
Citation
Target
Name:
Cathepsin K
Synonyms:
CATK_HUMAN CTSO Cathepsin O Cathepsin X
Type:
Enzyme
Mol. Mass.:
36975.68
Organism:
Homo sapiens (Human)
Description:
P43235
Residue:
329
  
Inhibitor
Name:
BDBM50306302
Synonyms:
(S)-N-(1-cyanocyclopropyl)-2-((S)-1-(4'-((R)-2,2-difluoro-1-hydroxyethyl)biphenyl-4-yl)-2,2,2-trifluoroethylamino)-4-fluoro-4-methylpentanamide | CHEMBL603899
Type:
Small organic molecule
Emp. Form.:
C26H27F6N3O2
Mol. Mass.:
527.5019
SMILES:
CC(C)(F)C[C@H](N[C@@H](c1ccc(cc1)-c1ccc(cc1)[C@@H](O)C(F)F)C(F)(F)F)C(=O)NC1(CC1)C#N
: