Target
Cathepsin K
Ligand
BDBM50306305
Substrate
Meas. Tech.
ChEMBL_609281 (CHEMBL1070042)
IC50
0.3±n/a nM
Citation
Target
Name:
Cathepsin K
Synonyms:
CATK_HUMAN CTSO Cathepsin O Cathepsin X
Type:
Enzyme
Mol. Mass.:
36975.68
Organism:
Homo sapiens (Human)
Description:
P43235
Residue:
329
  
Inhibitor
Name:
BDBM50306305
Synonyms:
(S)-N-(1-cyanocyclopropyl)-4-fluoro-4-methyl-2-((S)-2,2,2-trifluoro-1-(4-(5-(1-hydroxycyclopropyl)pyridin-2-yl)phenyl)ethylamino)pentanamide | CHEMBL597627
Type:
Small organic molecule
Emp. Form.:
C26H28F4N4O2
Mol. Mass.:
504.5197
SMILES:
CC(C)(F)C[C@H](N[C@@H](c1ccc(cc1)-c1ccc(cn1)C1(O)CC1)C(F)(F)F)C(=O)NC1(CC1)C#N
: