Target
Cathepsin K
Ligand
BDBM50306306
Substrate
Meas. Tech.
ChEMBL_609281 (CHEMBL1070042)
IC50
0.2±n/a nM
Citation
Target
Name:
Cathepsin K
Synonyms:
CATK_HUMAN CTSO Cathepsin O Cathepsin X
Type:
Enzyme
Mol. Mass.:
36975.68
Organism:
Homo sapiens (Human)
Description:
P43235
Residue:
329
  
Inhibitor
Name:
BDBM50306306
Synonyms:
(S)-N-(1-cyanocyclopropyl)-4-fluoro-4-methyl-2-((S)-2,2,2-trifluoro-1-(4'-(1-hydroxycyclopropyl)biphenyl-4-yl)ethylamino)pentanamide | CHEMBL605122
Type:
Small organic molecule
Emp. Form.:
C27H29F4N3O2
Mol. Mass.:
503.5317
SMILES:
CC(C)(F)C[C@H](N[C@@H](c1ccc(cc1)-c1ccc(cc1)C1(O)CC1)C(F)(F)F)C(=O)NC1(CC1)C#N
: