Target
Cathepsin K
Ligand
BDBM50306308
Substrate
Meas. Tech.
ChEMBL_609281 (CHEMBL1070042)
IC50
0.5±n/a nM
Citation
Target
Name:
Cathepsin K
Synonyms:
CATK_HUMAN CTSO Cathepsin O Cathepsin X
Type:
Enzyme
Mol. Mass.:
36975.68
Organism:
Homo sapiens (Human)
Description:
P43235
Residue:
329
  
Inhibitor
Name:
BDBM50306308
Synonyms:
1-(6-(4-((S)-1-((S)-1-(1-cyanocyclopropylamino)-4-fluoro-4-methyl-1-oxopentan-2-ylamino)-2,2,2-trifluoroethyl)phenyl)pyridin-3-yl)cyclopropanecarboxamide | CHEMBL598299
Type:
Small organic molecule
Emp. Form.:
C27H29F4N5O2
Mol. Mass.:
531.5451
SMILES:
CC(C)(F)C[C@H](N[C@@H](c1ccc(cc1)-c1ccc(cn1)C1(CC1)C(N)=O)C(F)(F)F)C(=O)NC1(CC1)C#N
: