Target
Cathepsin K
Ligand
BDBM50306310
Substrate
Meas. Tech.
ChEMBL_609281 (CHEMBL1070042)
IC50
0.3±n/a nM
Citation
Target
Name:
Cathepsin K
Synonyms:
CATK_HUMAN CTSO Cathepsin O Cathepsin X
Type:
Enzyme
Mol. Mass.:
36975.68
Organism:
Homo sapiens (Human)
Description:
P43235
Residue:
329
  
Inhibitor
Name:
BDBM50306310
Synonyms:
(S)-N-(1-cyanocyclopropyl)-4-fluoro-4-methyl-2-((S)-2,2,2-trifluoro-1-(4-(4-methylthiazol-2-yl)phenyl)ethylamino)pentanamide | CHEMBL598298
Type:
Small organic molecule
Emp. Form.:
C22H24F4N4OS
Mol. Mass.:
468.511
SMILES:
Cc1csc(n1)-c1ccc(cc1)[C@H](N[C@@H](CC(C)(C)F)C(=O)NC1(CC1)C#N)C(F)(F)F
: